Target
Dual specificity protein phosphatase 1
Ligand
BDBM50267087
Substrate
Meas. Tech.
ChEMBL_565116 (CHEMBL965760)
IC50
21800±n/a nM
Citation
 Cao, SMurphy, BTFoster, CLazo, JSKingston, DG Bioactivities of simplified adociaquinone B and naphthoquinone derivatives against Cdc25B, MKP-1, and MKP-3 phosphatases. Bioorg Med Chem 17:2276-81 (2009)  
Target
Name:
Dual specificity protein phosphatase 1
Synonyms:
3ch134 Dusp1 Ptpn10 | Ptpn16
Type:
PROTEIN
Mol. Mass.:
39372.46
Organism:
Mus musculus
Description:
ChEMBL_565116
Residue:
367
  
Inhibitor
Name:
BDBM50267087
Synonyms:
5,6,7,8-tetrahydroanthracene-1,4-dione | CHEMBL508233
Type:
Small organic molecule
Emp. Form.:
C14H12O2
Mol. Mass.:
212.2439
SMILES:
O=C1C=CC(=O)c2cc3CCCCc3cc12
: