Target
Dual specificity protein phosphatase 1
Ligand
BDBM50267116
Substrate
Meas. Tech.
ChEMBL_565116 (CHEMBL965760)
IC50
33800±n/a nM
Citation
 Cao, SMurphy, BTFoster, CLazo, JSKingston, DG Bioactivities of simplified adociaquinone B and naphthoquinone derivatives against Cdc25B, MKP-1, and MKP-3 phosphatases. Bioorg Med Chem 17:2276-81 (2009)  
Target
Name:
Dual specificity protein phosphatase 1
Synonyms:
3ch134 Dusp1 Ptpn10 | Ptpn16
Type:
PROTEIN
Mol. Mass.:
39372.46
Organism:
Mus musculus
Description:
ChEMBL_565116
Residue:
367
  
Inhibitor
Name:
BDBM50267116
Synonyms:
9-Hydroxy-1,1-dioxo-1,2,3,4-tetrahydro-1lambda6-naphtho[2,3-b][1,4]thiazine-5,10-dione | CHEMBL478485
Type:
Small organic molecule
Emp. Form.:
C12H9NO5S
Mol. Mass.:
279.269
SMILES:
Oc1cccc2C(=O)C3=NCCS(=O)(=O)C3C(=O)c12
: