Target
Dual specificity protein phosphatase 1
Ligand
BDBM50267088
Substrate
Meas. Tech.
ChEMBL_565116 (CHEMBL965760)
IC50
>50000±n/a nM
Citation
 Cao, SMurphy, BTFoster, CLazo, JSKingston, DG Bioactivities of simplified adociaquinone B and naphthoquinone derivatives against Cdc25B, MKP-1, and MKP-3 phosphatases. Bioorg Med Chem 17:2276-81 (2009)  
Target
Name:
Dual specificity protein phosphatase 1
Synonyms:
3ch134 Dusp1 Ptpn10 | Ptpn16
Type:
PROTEIN
Mol. Mass.:
39372.46
Organism:
Mus musculus
Description:
ChEMBL_565116
Residue:
367
  
Inhibitor
Name:
BDBM50267088
Synonyms:
4,5,6,7-tetrahydroanthra[2,3-b]oxirene-2,9(1aH,9aH)-dione | CHEMBL476649
Type:
Small organic molecule
Emp. Form.:
C14H12O3
Mol. Mass.:
228.2433
SMILES:
Oc1c2Oc2c(O)c2cc3CCCCc3cc12
: