Target
Dual specificity protein phosphatase 1
Ligand
BDBM50267170
Substrate
Meas. Tech.
ChEMBL_565116 (CHEMBL965760)
IC50
>50000±n/a nM
Citation
 Cao, SMurphy, BTFoster, CLazo, JSKingston, DG Bioactivities of simplified adociaquinone B and naphthoquinone derivatives against Cdc25B, MKP-1, and MKP-3 phosphatases. Bioorg Med Chem 17:2276-81 (2009)  
Target
Name:
Dual specificity protein phosphatase 1
Synonyms:
3ch134 Dusp1 Ptpn10 | Ptpn16
Type:
PROTEIN
Mol. Mass.:
39372.46
Organism:
Mus musculus
Description:
ChEMBL_565116
Residue:
367
  
Inhibitor
Name:
BDBM50267170
Synonyms:
2-(2-hydroxyethylamino)naphthalene-1,4-dione | CHEMBL462058
Type:
Small organic molecule
Emp. Form.:
C12H11NO3
Mol. Mass.:
217.2206
SMILES:
Oc1cc(NCC=O)c(O)c2ccccc12
: