Target
D(3) dopamine receptor
Ligand
BDBM50131930
Substrate
Meas. Tech.
ChEMBL_558362 (CHEMBL954164)
Ki
0.38±n/a nM
Citation
 Butini, SGemma, SCampiani, GFranceschini, STrotta, FBorriello, MCeres, NRos, SCoccone, SSBernetti, MDe Angelis, MBrindisi, MNacci, VFiorini, INovellino, ECagnotto, AMennini, TSandager-Nielsen, KAndreasen, JTScheel-Kruger, JMikkelsen, JDFattorusso, C Discovery of a new class of potential multifunctional atypical antipsychotic agents targeting dopamine D3 and serotonin 5-HT1A and 5-HT2A receptors: design, synthesis, and effects on behavior. J Med Chem 52:151-69 (2009)  
Target
Name:
D(3) dopamine receptor
Synonyms:
DOPAMINE D3 DRD3_HUMAN Dopamine D3 receptor (D3) Dopamine receptor Dopamine receptor D3
Type:
Mol. Mass.:
44243.43
Organism:
Homo sapiens (Human)
Description:
Residue:
400
  
Inhibitor
Name:
BDBM50131930
Synonyms:
5-Chloro-1H-indole-2-carboxylic acid {4-[4-(2,4-dichloro-phenyl)-piperazin-1-yl]-butyl}-amide CHEMBL126889
Type:
Small organic molecule
Emp. Form.:
C23H25Cl3N4O
Mol. Mass.:
479.83
SMILES:
Clc1ccc(N2CCN(CCCCNC(=O)c3cc4cc(Cl)ccc4[nH]3)CC2)c(Cl)c1
: