Target
C-C chemokine receptor type 4
Ligand
BDBM50265669
Substrate
Meas. Tech.
ChEMBL_558791 (CHEMBL1020785)
IC50
23±n/a nM
Citation
 Yokoyama, KIshikawa, NIgarashi, SKawano, NMasuda, NHamaguchi, WYamasaki, SKoganemaru, YHattori, KMiyazaki, TOgino, SMatsumoto, YTakeuchi, MOhta, M Potent and orally bioavailable CCR4 antagonists: Synthesis and structure-activity relationship study of 2-aminoquinazolines. Bioorg Med Chem 17:64-73 (2008)  
Target
Name:
C-C chemokine receptor type 4
Synonyms:
C-C CKR-4 C-C chemokine receptor type 4 (CCR4) CCR-4 CCR4_HUMAN CMKBR4 | K5-5
Type:
Enzyme
Mol. Mass.:
41406.41
Organism:
Homo sapiens (Human)
Description:
P51679
Residue:
360
  
Inhibitor
Name:
BDBM50265669
Synonyms:
(1'-{4-[(4-Chlorophenyl)amino]-6,7-dimethoxyquinazolin-2-yl}-1,4'-bipiperidin-3-yl)methanol | CHEMBL496356
Type:
Small organic molecule
Emp. Form.:
C27H34ClN5O3
Mol. Mass.:
512.044
SMILES:
COc1cc2nc(nc(Nc3ccc(Cl)cc3)c2cc1OC)N1CCC(CC1)N1CCCC(CO)C1
: