Target
Cannabinoid receptor 2
Ligand
BDBM50277270
Substrate
Meas. Tech.
ChEMBL_540514 (CHEMBL1031455)
EC50
110±n/a nM
Citation
 Goodman, AJAjello, CWWorm, KLe Bourdonnec, BSavolainen, MAO'Hare, HCassel, JAStabley, GJDehaven, RNLabuda, CJKoblish, MLittle, PJBrogdon, BLSmith, SADolle, RE CB2 selective sulfamoyl benzamides: optimization of the amide functionality. Bioorg Med Chem Lett 19:309-13 (2008)  
Target
Name:
Cannabinoid receptor 2
Synonyms:
CANNABINOID CB2 CB2 CB2B CNR2_HUMAN Cannabinoid CB2 receptor Cannabinoid receptor 2 (CB2R) | hCB2
Type:
G Protein-Coupled Receptor (GPCR)
Mol. Mass.:
39690.94
Organism:
Homo sapiens (Human)
Description:
P34972
Residue:
360
  
Inhibitor
Name:
BDBM50277270
Synonyms:
4-(5-(5-(cyclohexylmethyl)-1,2,4-oxadiazol-3-yl)-2-methylphenylsulfonyl)morpholine | CHEMBL472680
Type:
Small organic molecule
Emp. Form.:
C20H27N3O4S
Mol. Mass.:
405.511
SMILES:
Cc1ccc(cc1S(=O)(=O)N1CCOCC1)-c1noc(CC2CCCCC2)n1
: