Target
Fructose-1,6-bisphosphatase 1
Ligand
BDBM50259669
Substrate
Meas. Tech.
ChEMBL_516599 (CHEMBL988686)
IC50
>300000±n/a nM
Citation
 Rudnitskaya, AHuynh, KTörök, BStieglitz, K Novel heteroaromatic organofluorine inhibitors of fructose-1,6-bisphosphatase. J Med Chem 52:878-82 (2009)  
Target
Name:
Fructose-1,6-bisphosphatase 1
Synonyms:
F16P1_MOUSE Fbp1 | Fbp3
Type:
PROTEIN
Mol. Mass.:
36912.07
Organism:
Mus musculus
Description:
ChEMBL_748173
Residue:
338
  
Inhibitor
Name:
BDBM50259669
Synonyms:
CHEMBL446253 methyl carbazole-3-carboxylate
Type:
Small organic molecule
Emp. Form.:
C14H11NO2
Mol. Mass.:
225.2426
SMILES:
COC(=O)c1ccc2[nH]c3ccccc3c2c1
: