Target
11-beta-hydroxysteroid dehydrogenase 1
Ligand
BDBM50248425
Substrate
Meas. Tech.
ChEMBL_543010 (CHEMBL1018626)
IC50
55±n/a nM
Citation
 Sun, DWang, ZCardozo, MChoi, RDegraffenreid, MDi, YHe, XJaen, JCLabelle, MLiu, JMa, JMiao, SSudom, ATang, LTu, HUrsu, SWalker, NYan, XYe, QPowers, JP Synthesis and optimization of arylsulfonylpiperazines as a novel class of inhibitors of 11 beta-hydroxysteroid dehydrogenase type 1 (11 beta-HSD1). Bioorg Med Chem Lett 19:1522-7 (2009)  
Target
Name:
11-beta-hydroxysteroid dehydrogenase 1
Synonyms:
11-DH 11-beta-Hydroxysteroid Dehydrogenase 1 (11-beta-HSD1) 11-beta-hydroxysteroid dehydrogenase 1 (11HSD1) Corticosteroid 11-beta-dehydrogenase isozyme 1 (11-beta-HSD-1) Corticosteroid 11-beta-dehydrogenase isozyme 1 (11beta-HSD1) HSD11 HSD11L | SDR26C1
Type:
Enzyme
Mol. Mass.:
32409.16
Organism:
Homo sapiens (Human)
Description:
P28845
Residue:
292
  
Inhibitor
Name:
BDBM50248425
Synonyms:
(R)-(1-(4-(2-methyl-4-(2-(pyridin-4-yl)ethyl)piperazin-1-ylsulfonyl)phenyl)cyclopropyl)methanol | CHEMBL489511
Type:
Small organic molecule
Emp. Form.:
C22H29N3O3S
Mol. Mass.:
415.549
SMILES:
C[C@@H]1CN(CCc2ccncc2)CCN1S(=O)(=O)c1ccc(cc1)C1(CO)CC1
: