Target
11-beta-hydroxysteroid dehydrogenase 1
Ligand
BDBM50248569
Substrate
Meas. Tech.
ChEMBL_543009 (CHEMBL1018625)
IC50
0.7±n/a nM
Citation
 Sun, DWang, ZCardozo, MChoi, RDegraffenreid, MDi, YHe, XJaen, JCLabelle, MLiu, JMa, JMiao, SSudom, ATang, LTu, HUrsu, SWalker, NYan, XYe, QPowers, JP Synthesis and optimization of arylsulfonylpiperazines as a novel class of inhibitors of 11 beta-hydroxysteroid dehydrogenase type 1 (11 beta-HSD1). Bioorg Med Chem Lett 19:1522-7 (2009)  
Target
Name:
11-beta-hydroxysteroid dehydrogenase 1
Synonyms:
11-DH 11-beta-Hydroxysteroid Dehydrogenase 1 (11-beta-HSD1) 11-beta-hydroxysteroid dehydrogenase 1 (11HSD1) Corticosteroid 11-beta-dehydrogenase isozyme 1 (11-beta-HSD-1) Corticosteroid 11-beta-dehydrogenase isozyme 1 (11beta-HSD1) HSD11 HSD11L | SDR26C1
Type:
Enzyme
Mol. Mass.:
32409.16
Organism:
Homo sapiens (Human)
Description:
P28845
Residue:
292
  
Inhibitor
Name:
BDBM50248569
Synonyms:
(1-(((R)-3-methyl-4-(4-((S)-1,1,1-trifluoro-2-hydroxypropan-2-yl)phenylsulfonyl)-piperazin-1-yl)methyl)-cyclopropanecarboxamide) 1-{[(3R)-3-methyl-4-({4-[(1S)-2,2,2-trifluoro-1-hydroxy-1-methylethyl]phenyl}sulfonyl)piperazin-1-yl]methyl}cyclopropanecarboxamide | CHEMBL460962
Type:
Small organic molecule
Emp. Form.:
C19H26F3N3O4S
Mol. Mass.:
449.488
SMILES:
C[C@@H]1CN(CC2(CC2)C(N)=O)CCN1S(=O)(=O)c1ccc(cc1)[C@](C)(O)C(F)(F)F
: