Target
Potassium voltage-gated channel subfamily H member 2
Ligand
BDBM50248569
Substrate
Meas. Tech.
ChEMBL_543016 (CHEMBL1018632)
IC50
>100000±n/a nM
Citation
 Sun, DWang, ZCardozo, MChoi, RDegraffenreid, MDi, YHe, XJaen, JCLabelle, MLiu, JMa, JMiao, SSudom, ATang, LTu, HUrsu, SWalker, NYan, XYe, QPowers, JP Synthesis and optimization of arylsulfonylpiperazines as a novel class of inhibitors of 11 beta-hydroxysteroid dehydrogenase type 1 (11 beta-HSD1). Bioorg Med Chem Lett 19:1522-7 (2009)  
Target
Name:
Potassium voltage-gated channel subfamily H member 2
Synonyms:
1,3-beta-glucan synthase component GLS2 ERG Eag-related protein 1 Ether-a-go-go-related gene (HERG) Ether-a-go-go-related gene potassium channel 1 Ether-a-go-go-related gene potassium channel 1 (hERG1) Ether-a-go-go-related protein 1 H-ERG KCNH2 Potassium voltage-gated channel subfamily H member 2 (hERG) Voltage-gated potassium channel subunit Kv11.1 hERG Potassium Channel 1 | putative potassium channel subunit
Type:
Multi-pass membrane protein
Mol. Mass.:
126672.65
Organism:
Homo sapiens (Human)
Description:
Q12809
Residue:
1159
  
Inhibitor
Name:
BDBM50248569
Synonyms:
(1-(((R)-3-methyl-4-(4-((S)-1,1,1-trifluoro-2-hydroxypropan-2-yl)phenylsulfonyl)-piperazin-1-yl)methyl)-cyclopropanecarboxamide) 1-{[(3R)-3-methyl-4-({4-[(1S)-2,2,2-trifluoro-1-hydroxy-1-methylethyl]phenyl}sulfonyl)piperazin-1-yl]methyl}cyclopropanecarboxamide | CHEMBL460962
Type:
Small organic molecule
Emp. Form.:
C19H26F3N3O4S
Mol. Mass.:
449.488
SMILES:
C[C@@H]1CN(CC2(CC2)C(N)=O)CCN1S(=O)(=O)c1ccc(cc1)[C@](C)(O)C(F)(F)F
: