Target
C-X-C chemokine receptor type 1
Ligand
BDBM50248403
Substrate
Meas. Tech.
ChEMBL_566225 (CHEMBL963306)
Ki
25±n/a nM
Citation
 Biju, PTaveras, AGDwyer, MPYu, YChao, JHipkin, RWFan, XRindgen, DFine, JLundell, D Fluoroalkyl alpha side chain containing 3,4-diamino-cyclobutenediones as potent and orally bioavailable CXCR2-CXCR1 dual antagonists. Bioorg Med Chem Lett 19:1431-3 (2009)  
Target
Name:
C-X-C chemokine receptor type 1
Synonyms:
C-X-C chemokine receptor type 1 (CXCR-1) CMKAR1 CXCR1_HUMAN Interleukin-8 receptor A | Interleukin-8 receptors, CXCR1/CXCR2
Type:
Enzyme
Mol. Mass.:
39803.83
Organism:
Homo sapiens (Human)
Description:
P25024
Residue:
350
  
Inhibitor
Name:
BDBM50248403
Synonyms:
(S)-3-(2-(2,2-difluoro-1-(4-isopropylfuran-2-yl)propylamino)-3,4-dioxocyclobut-1-enylamino)-2-hydroxy-N,N-dimethylbenzamide | CHEMBL523769
Type:
Small organic molecule
Emp. Form.:
C23H25F2N3O5
Mol. Mass.:
461.4585
SMILES:
CC(C)c1coc(c1)[C@H](Nc1c(Nc2cccc(C(=O)N(C)C)c2O)c(=O)c1=O)C(C)(F)F
: