Target
C-X-C chemokine receptor type 1
Ligand
BDBM50248279
Substrate
Meas. Tech.
ChEMBL_566225 (CHEMBL963306)
Ki
6±n/a nM
Citation
 Biju, PTaveras, AGDwyer, MPYu, YChao, JHipkin, RWFan, XRindgen, DFine, JLundell, D Fluoroalkyl alpha side chain containing 3,4-diamino-cyclobutenediones as potent and orally bioavailable CXCR2-CXCR1 dual antagonists. Bioorg Med Chem Lett 19:1431-3 (2009)  
Target
Name:
C-X-C chemokine receptor type 1
Synonyms:
C-X-C chemokine receptor type 1 (CXCR-1) CMKAR1 CXCR1_HUMAN Interleukin-8 receptor A | Interleukin-8 receptors, CXCR1/CXCR2
Type:
Enzyme
Mol. Mass.:
39803.83
Organism:
Homo sapiens (Human)
Description:
P25024
Residue:
350
  
Inhibitor
Name:
BDBM50248279
Synonyms:
(S)-3-(3,4-dioxo-2-(2,2,2-trifluoro-1-(furan-2-yl)ethylamino)cyclobut-1-enylamino)-2-hydroxy-N,N-dimethylbenzamide | CHEMBL473959
Type:
Small organic molecule
Emp. Form.:
C19H16F3N3O5
Mol. Mass.:
423.3426
SMILES:
CN(C)C(=O)c1cccc(Nc2c(N[C@@H](c3ccco3)C(F)(F)F)c(=O)c2=O)c1O
: