Target
Protection of telomeres protein 1
Ligand
BDBM50276829
Substrate
Meas. Tech.
ChEMBL_541324 (CHEMBL1027378)
IC50
11000±n/a nM
Citation
 Fu, YTKeppler, BRSoares, JJarstfer, MB BRACO19 analog dimers with improved inhibition of telomerase and hPot 1. Bioorg Med Chem 17:2030-7 (2009)  
Target
Name:
Protection of telomeres protein 1
Synonyms:
POT1 | POTE1_HUMAN
Type:
PROTEIN
Mol. Mass.:
71443.74
Organism:
Homo sapiens (Human)
Description:
ChEMBL_541324
Residue:
634
  
Inhibitor
Name:
BDBM50276829
Synonyms:
CHEMBL443702 | N,N',N'',N'''-(9,9'-(ethane-1,2-diylbis(azanediyl))bis(methylene)bis(azanediyl)bis(acridine-9,6,3-triyl))tetrakis(3-(pyrrolidin-1-yl)propanamide)
Type:
Small organic molecule
Emp. Form.:
C58H76N14O4
Mol. Mass.:
1033.3154
SMILES:
O=C(CCN1CCCC1)Nc1ccc2c(NCNCCNCNc3c4ccc(NC(=O)CCN5CCCC5)cc4nc4cc(NC(=O)CCN5CCCC5)ccc34)c3ccc(NC(=O)CCN4CCCC4)cc3nc2c1
: