Target
Epidermal growth factor receptor
Ligand
BDBM50248294
Substrate
Meas. Tech.
ChEMBL_566606 (CHEMBL964945)
IC50
240±n/a nM
Citation
 Tasler, SMüller, OWieber, THerz, TKrauss, RTotzke, FKubbutat, MHSchächtele, C N-substituted 2'-(aminoaryl)benzothiazoles as kinase inhibitors: hit identification and scaffold hopping. Bioorg Med Chem Lett 19:1349-56 (2009)  
Target
Name:
Epidermal growth factor receptor
Synonyms:
EGF Receptor Substrate EGFR_HUMAN ERBB1 Epidermal Growth Factor Receptor erbB-1 Epidermal growth factor receptor (EGFR) HER1 Proto-oncogene c-ErbB-1 Tyrosine-Protein Kinase ErbB-1
Type:
Receptor Kinase Domain
Mol. Mass.:
134279.59
Organism:
Homo sapiens (Human)
Description:
P00533
Residue:
1210
  
Inhibitor
Name:
BDBM50248294
Synonyms:
CHEMBL514942 | N-(4-(benzo[d]thiazol-2-yl)-2-methylphenyl)-6,7-dimethoxyquinazolin-4-amine
Type:
Small organic molecule
Emp. Form.:
C24H20N4O2S
Mol. Mass.:
428.506
SMILES:
COc1cc2ncnc(Nc3ccc(cc3C)-c3nc4ccccc4s3)c2cc1OC
: