Target
Tyrosine-protein kinase SYK
Ligand
BDBM50249208
Substrate
Meas. Tech.
ChEMBL_499518 (CHEMBL1022010)
IC50
3800±n/a nM
Citation
 Xie, HZLi, LLRen, JXZou, JYang, LWei, YQYang, SY Pharmacophore modeling study based on known spleen tyrosine kinase inhibitors together with virtual screening for identifying novel inhibitors. Bioorg Med Chem Lett 19:1944-9 (2009)  
Target
Name:
Tyrosine-protein kinase SYK
Synonyms:
KSYK_HUMAN Spleen Tyrosine Kinase Tyrosine-protein kinase SYK (Syk)
Type:
Enzyme
Mol. Mass.:
72079.99
Organism:
Homo sapiens (Human)
Description:
P43405
Residue:
635
  
Inhibitor
Name:
BDBM50249208
Synonyms:
2-methoxy-4-(2-nitrovinyl)phenyl benzoate | CHEMBL470717
Type:
Small organic molecule
Emp. Form.:
C16H13NO5
Mol. Mass.:
299.2781
SMILES:
COc1cc(\C=C\[N+]([O-])=O)ccc1OC(=O)c1ccccc1
: