Target
Cholecystokinin receptor type A
Ligand
BDBM50278305
Substrate
Meas. Tech.
ChEMBL_564593 (CHEMBL964033)
IC50
46±n/a nM
Citation
 Lassiani, LPavan, MVBerti, FKokotos, GMarkidis, TMennuni, LMakovec, FVarnavas, A Anthranilic acid based CCK1 receptor antagonists: blocking the receptor with the same 'words' of the endogenous ligand. Bioorg Med Chem 17:2336-50 (2009)  
Target
Name:
Cholecystokinin receptor type A
Synonyms:
CCKAR_RAT Cholecystokinin peripheral Cholecystokinin receptor type A
Type:
Enzyme Catalytic Domain
Mol. Mass.:
49676.37
Organism:
RAT
Description:
Cholecystokinin central 0 RAT::P30551
Residue:
444
  
Inhibitor
Name:
BDBM50278305
Synonyms:
2(R)-{2-[(1H-Indole-2-carbonyl)-amino]-benzoylamino}-4-methyl-pentanoic acid | CHEMBL469341
Type:
Small organic molecule
Emp. Form.:
C22H23N3O4
Mol. Mass.:
393.4357
SMILES:
CC(C)C[C@@H](NC(=O)c1ccccc1NC(=O)c1cc2ccccc2[nH]1)C(O)=O
: