Target
Cholecystokinin receptor type A
Ligand
BDBM50278305
Substrate
Meas. Tech.
ChEMBL_564596 (CHEMBL964036)
IC50
14700±n/a nM
Citation
 Lassiani, LPavan, MVBerti, FKokotos, GMarkidis, TMennuni, LMakovec, FVarnavas, A Anthranilic acid based CCK1 receptor antagonists: blocking the receptor with the same 'words' of the endogenous ligand. Bioorg Med Chem 17:2336-50 (2009)  
Target
Name:
Cholecystokinin receptor type A
Synonyms:
CCK-A receptor CCK1-R CCKAR_CAVPO Cholecystokinin receptor type A | Cholecystokinin-1 receptor
Type:
Mol. Mass.:
48229.77
Organism:
Cavia porcellus
Description:
Residue:
430
  
Inhibitor
Name:
BDBM50278305
Synonyms:
2(R)-{2-[(1H-Indole-2-carbonyl)-amino]-benzoylamino}-4-methyl-pentanoic acid | CHEMBL469341
Type:
Small organic molecule
Emp. Form.:
C22H23N3O4
Mol. Mass.:
393.4357
SMILES:
CC(C)C[C@@H](NC(=O)c1ccccc1NC(=O)c1cc2ccccc2[nH]1)C(O)=O
: