Target
Oxysterols receptor LXR-beta
Ligand
BDBM50258173
Substrate
Meas. Tech.
ChEMBL_566454 (CHEMBL958321)
EC50
>100000±n/a nM
Citation
 Swahn, BMMacsari, IViklund, JOhberg, LSjödin, JNeelissen, JLindquist, J Liver X receptor agonists with selectivity for LXRbeta; N-aryl-3,3,3-trifluoro-2-hydroxy-2-methylpropionamides. Bioorg Med Chem Lett 19:2009-12 (2009)  
Target
Name:
Oxysterols receptor LXR-beta
Synonyms:
LXRB Liver X, LXR beta NR1H2 Nuclear receptor NER Ubiquitously-expressed nuclear receptor
Type:
Enzyme Catalytic Domain
Mol. Mass.:
50978.79
Organism:
Homo sapiens (Human)
Description:
P55055
Residue:
460
  
Inhibitor
Name:
BDBM50258173
Synonyms:
3-(4-(N-(3-chloro-4-(3,3,3-trifluoro-2-hydroxy-2-methylpropanamido)phenyl)-N-methylsulfamoyl)phenyl)propanoic acid | CHEMBL492563
Type:
Small organic molecule
Emp. Form.:
C20H20ClF3N2O6S
Mol. Mass.:
508.896
SMILES:
CN(c1ccc(NC(=O)C(C)(O)C(F)(F)F)c(Cl)c1)S(=O)(=O)c1ccc(CCC(O)=O)cc1
: