Target
Oxysterols receptor LXR-alpha
Ligand
BDBM50258119
Substrate
Meas. Tech.
ChEMBL_566734 (CHEMBL961726)
EC50
>30000±n/a nM
Citation
 Swahn, BMMacsari, IViklund, JOhberg, LSjödin, JNeelissen, JLindquist, J Liver X receptor agonists with selectivity for LXRbeta; N-aryl-3,3,3-trifluoro-2-hydroxy-2-methylpropionamides. Bioorg Med Chem Lett 19:2009-12 (2009)  
Target
Name:
Oxysterols receptor LXR-alpha
Synonyms:
LXRA Liver X receptor alpha Liver X receptor alpha (NR1H3) NR1H3 Nuclear orphan receptor LXR-alpha | Nuclear receptor subfamily 1 group H member 3
Type:
Enzyme Catalytic Domain
Mol. Mass.:
50403.85
Organism:
Homo sapiens (Human)
Description:
Q13133
Residue:
447
  
Inhibitor
Name:
BDBM50258119
Synonyms:
CHEMBL495020 | N-(2-chloro-4-(2-chloro-N-(cyclopropylmethyl)phenylsulfonamido)phenyl)-3,3,3-trifluoro-2-hydroxy-2-methylpropanamide
Type:
Small organic molecule
Emp. Form.:
C20H19Cl2F3N2O4S
Mol. Mass.:
511.342
SMILES:
CC(O)(C(=O)Nc1ccc(cc1Cl)N(CC1CC1)S(=O)(=O)c1ccccc1Cl)C(F)(F)F
: