Target
Neurotensin receptor type 1
Ligand
BDBM50257198
Substrate
Meas. Tech.
ChEMBL_562549 (CHEMBL1014541)
Ki
2170±n/a nM
Citation
 Orwig, KSLassetter, MRHadden, MKDix, TA Comparison of N-terminal modifications on neurotensin(8-13) analogues correlates peptide stability but not binding affinity with in vivo efficacy. J Med Chem 52:1803-13 (2009)  
Target
Name:
Neurotensin receptor type 1
Synonyms:
Dopamine receptor D2L/neurotensin receptor NTS1 NTRR Neurotensin receptor 1 | neurotensin receptor type 1
Type:
PROTEIN
Mol. Mass.:
46278.89
Organism:
Homo sapiens (Human)
Description:
ChEMBL_1453811
Residue:
418
  
Inhibitor
Name:
BDBM50257198
Synonyms:
(S)-2-((S)-2-((S)-2-((S)-1-((S)-6-amino-2-((S)-2-amino-5-guanidino-2-methylpentanamido)hexanoyl)pyrrolidine-2-carboxamido)-3-(1H-indol-3-yl)propanamido)-3,3-dimethylbutanamido)-4-methylpentanoic acid | CHEMBL501956
Type:
Small organic molecule
Emp. Form.:
C41H67N11O7
Mol. Mass.:
826.0402
SMILES:
CC(C)C[C@H](NC(=O)[C@@H](NC(=O)[C@H](Cc1c[nH]c2ccccc12)NC(=O)[C@@H]1CCCN1C(=O)[C@H](CCCCN)NC(=O)[C@@](C)(N)CCCN=C(N)N)C(C)(C)C)C(O)=O
: