Target
Bifunctional epoxide hydrolase 2
Ligand
BDBM50278163
Substrate
Meas. Tech.
ChEMBL_497574 (CHEMBL999421)
IC50
7.9±n/a nM
Citation
 Xie, YLiu, YGong, GSmith, DHYan, FRinderspacher, AFeng, YZhu, ZLi, XDeng, SXBranden, LVidovic, DChung, CSchürer, SMorisseau, CHammock, BDLandry, DW Discovery of potent non-urea inhibitors of soluble epoxide hydrolase. Bioorg Med Chem Lett 19:2354-9 (2009)  
Target
Name:
Bifunctional epoxide hydrolase 2
Synonyms:
Cytosolic epoxide hydrolase 2 EPHX2 HYES_HUMAN Soluble epoxide hydrolase (sEH) | epoxide hydrolase 2, cytoplasmic
Type:
Enzyme
Mol. Mass.:
62613.07
Organism:
Homo sapiens (Human)
Description:
P34913
Residue:
555
  
Inhibitor
Name:
BDBM50278163
Synonyms:
CHEMBL469792 | N-cycloheptyl-1-(mesitylsulfonyl)piperidine-4-carboxamide
Type:
Small organic molecule
Emp. Form.:
C22H34N2O3S
Mol. Mass.:
406.582
SMILES:
Cc1cc(C)c(c(C)c1)S(=O)(=O)N1CCC(CC1)C(=O)NC1CCCCCC1
: