Target
1-phosphatidylinositol 4,5-bisphosphate phosphodiesterase gamma-2
Ligand
BDBM50256801
Substrate
Meas. Tech.
ChEMBL_562793 (CHEMBL1018873)
IC50
2000±n/a nM
Citation
 Reynisson, JCourt, WO'Neill, CDay, JPatterson, LMcDonald, EWorkman, PKatan, MEccles, SA The identification of novel PLC-gamma inhibitors using virtual high throughput screening. Bioorg Med Chem 17:3169-76 (2009)  
Target
Name:
1-phosphatidylinositol 4,5-bisphosphate phosphodiesterase gamma-2
Synonyms:
PLCG2 Phospholipase C-gamma-2
Type:
PROTEIN
Mol. Mass.:
147869.71
Organism:
Homo sapiens (Human)
Description:
ChEMBL_562793
Residue:
1265
  
Inhibitor
Name:
BDBM50256801
Synonyms:
4-((5-oxo-2-phenyloxazol-4(5H)-ylidene)methyl)benzonitrile | CHEMBL455766
Type:
Small organic molecule
Emp. Form.:
C17H10N2O2
Mol. Mass.:
274.2735
SMILES:
O=C1OC(=N\C1=C\c1ccc(cc1)C#N)c1ccccc1
: