Target
5-hydroxytryptamine receptor 2B
Ligand
BDBM50249180
Substrate
Meas. Tech.
ChEMBL_499778 (CHEMBL968751)
IC50
270±n/a nM
Citation
 Moss, NChoi, YCogan, DFlegg, AKahrs, ALoke, PMeyn, ONagaraja, RNapier, SParker, AThomas Peterson, JRamsden, PSarko, CSkow, DTomlinson, JTye, HWhitaker, M A new class of 5-HT2B antagonists possesses favorable potency, selectivity, and rat pharmacokinetic properties. Bioorg Med Chem Lett 19:2206-10 (2009)  
Target
Name:
5-hydroxytryptamine receptor 2B
Synonyms:
5-HT-2B 5-hydroxytryptamine (serotonin) receptor 2B [Homo sapiens] 5-hydroxytryptamine receptor 2C (5HT2C) HTR2B Serotonin 2b (5-HT2b) receptor | Serotonin Receptor 2B
Type:
G Protein-Coupled Receptor (GPCR)
Mol. Mass.:
54312.47
Organism:
Homo sapiens (Human)
Description:
Receptor binding assays were performed using human clone stably expressed in CHO cells.
Residue:
481
  
Inhibitor
Name:
BDBM50249180
Synonyms:
5-((4-(6-chlorothieno[2,3-d]pyrimidin-4-ylamino)piperidin-1-yl)methyl)-2-fluorobenzonitrile | CHEMBL513994
Type:
Small organic molecule
Emp. Form.:
C19H17ClFN5S
Mol. Mass.:
401.888
SMILES:
Fc1ccc(CN2CCC(CC2)Nc2ncnc3sc(Cl)cc23)cc1C#N
: