Target
5-hydroxytryptamine receptor 2B
Ligand
BDBM50249485
Substrate
Meas. Tech.
ChEMBL_499777 (CHEMBL968750)
IC50
1100±n/a nM
Citation
 Moss, NChoi, YCogan, DFlegg, AKahrs, ALoke, PMeyn, ONagaraja, RNapier, SParker, AThomas Peterson, JRamsden, PSarko, CSkow, DTomlinson, JTye, HWhitaker, M A new class of 5-HT2B antagonists possesses favorable potency, selectivity, and rat pharmacokinetic properties. Bioorg Med Chem Lett 19:2206-10 (2009)  
Target
Name:
5-hydroxytryptamine receptor 2B
Synonyms:
5-HT-2B 5-hydroxytryptamine (serotonin) receptor 2B [Homo sapiens] 5-hydroxytryptamine receptor 2C (5HT2C) HTR2B Serotonin 2b (5-HT2b) receptor | Serotonin Receptor 2B
Type:
G Protein-Coupled Receptor (GPCR)
Mol. Mass.:
54312.47
Organism:
Homo sapiens (Human)
Description:
Receptor binding assays were performed using human clone stably expressed in CHO cells.
Residue:
481
  
Inhibitor
Name:
BDBM50249485
Synonyms:
2-((1-(biphenyl-4-ylsulfonyl)piperidin-4-yl)methyl)-1H-benzo[d]imidazole | CHEMBL473235
Type:
Small organic molecule
Emp. Form.:
C25H25N3O2S
Mol. Mass.:
431.55
SMILES:
O=S(=O)(N1CCC(Cc2nc3ccccc3[nH]2)CC1)c1ccc(cc1)-c1ccccc1
: