Target
Adenosine receptor A3
Ligand
BDBM50267578
Substrate
Meas. Tech.
ChEMBL_562994 (CHEMBL1015331)
Ki
129±n/a nM
Citation
 Franchetti, PCappellacci, LVita, PPetrelli, RLavecchia, AKachler, SKlotz, KNMarabese, ILuongo, LMaione, SGrifantini, M N6-Cycloalkyl- and N6-bicycloalkyl-C5'(C2')-modified adenosine derivatives as high-affinity and selective agonists at the human A1 adenosine receptor with antinociceptive effects in mice. J Med Chem 52:2393-406 (2009)  
Target
Name:
Adenosine receptor A3
Synonyms:
A3 adenosine receptor (hA3) ADORA3 | Adenosine A3 receptor (A3AR)
Type:
G Protein-Coupled Receptor (GPCR)
Mol. Mass.:
36197.32
Organism:
Homo sapiens (Human)
Description:
P0DMS8
Residue:
318
  
Inhibitor
Name:
BDBM50267578
Synonyms:
2-Chloro-N6-(+/-)-endo-norbornyl-9H-(beta-D-ribofuranosyl)adenine | CHEMBL490250
Type:
Small organic molecule
Emp. Form.:
C17H22ClN5O4
Mol. Mass.:
395.841
SMILES:
OC[C@H]1O[C@H]([C@H](O)[C@@H]1O)n1cnc2c(NC3CC4CCC3C4)nc(Cl)nc12
: