Target
Cannabinoid receptor 1
Ligand
BDBM50267543
Substrate
Meas. Tech.
ChEMBL_563053 (CHEMBL1011883)
EC50
0.5±n/a nM
Citation
 Vachal, PFletcher, JMFong, TMHuang, CCLao, JXiao, JCShen, CPStrack, AMShearman, LStribling, SChen, RZFrassetto, ATong, XWang, JBall, RGTsou, NNHickey, GJThompson, DFFaidley, TDNicolich, SAchanfuo-Yeboah, JHora, DFHale, JJHagmann, WK 1-Sulfonyl-4-acylpiperazines as selective cannabinoid-1 receptor (CB1R) inverse agonists for the treatment of obesity. J Med Chem 52:2550-8 (2009)  
Target
Name:
Cannabinoid receptor 1
Synonyms:
CANN6 CB-R CNR CNR1_HUMAN Cannabinoid receptor Cannabinoid receptor 1 (brain)
Type:
G Protein-Coupled Receptor (GPCR)
Mol. Mass.:
52868.96
Organism:
Homo sapiens (Human)
Description:
P21554
Residue:
472
  
Inhibitor
Name:
BDBM50267543
Synonyms:
1-(4-(3,5-dichlorophenylsulfonyl)piperazin-1-yl)-3-(4-(trifluoromethyl)phenyl)propan-1-one | CHEMBL489031
Type:
Small organic molecule
Emp. Form.:
C20H19Cl2F3N2O3S
Mol. Mass.:
495.343
SMILES:
FC(F)(F)c1ccc(CCC(=O)N2CCN(CC2)S(=O)(=O)c2cc(Cl)cc(Cl)c2)cc1
: