Target
Nociceptin receptor
Ligand
BDBM50259104
Substrate
Meas. Tech.
ChEMBL_500674 (CHEMBL966890)
Ki
7.4±n/a nM
Citation
 Ho, GDAnthes, JBercovici, ACaldwell, JPCheng, KCCui, XFawzi, AFernandez, XGreenlee, WJHey, JKorfmacher, WLu, SXMcLeod, RLNg, FTorhan, ASTan, ZTulshian, DVarty, GBXu, XZhang, H The discovery of tropane derivatives as nociceptin receptor ligands for the management of cough and anxiety. Bioorg Med Chem Lett 19:2519-23 (2009)  
Target
Name:
Nociceptin receptor
Synonyms:
KOR-3 Mu-type opioid receptor (Mu) Nociceptin Receptor (ORL1 Receptor) Nociceptin receptor (ORL-1) Nociceptin/Orphanin FQ, NOP receptor OPIATE ORL-1 OPRL1 protein ORL1 Opioid receptor like-1 Orphanin FQ receptor (ORL1) | P41146
Type:
G Protein-Coupled Receptor (GPCR)
Mol. Mass.:
40702.87
Organism:
Homo sapiens (Human)
Description:
P41146
Residue:
370
  
Inhibitor
Name:
BDBM50259104
Synonyms:
8-((2-chloro-4-methylphenyl)(2-chlorophenyl)methyl)-3-(3-hydroxypropyl)-8-azabicyclo[3.2.1]octan-3-ol | CHEMBL512247
Type:
Small organic molecule
Emp. Form.:
C24H29Cl2NO2
Mol. Mass.:
434.399
SMILES:
Cc1ccc(C(N2C3CCC2CC(O)(CCCO)C3)c2ccccc2Cl)c(Cl)c1
: