Target
Glycogen phosphorylase, muscle form
Ligand
BDBM50277972
Substrate
Meas. Tech.
ChEMBL_502059 (CHEMBL981270)
EC50
>250000±n/a nM
Citation
 Dang, QBrown, BSLiu, YRydzewski, RMRobinson, EDvan Poelje, PDReddy, MRErion, MD Fructose-1,6-bisphosphatase inhibitors. 1. Purine phosphonic acids as novel AMP mimics. J Med Chem 52:2880-98 (2009)  
Target
Name:
Glycogen phosphorylase, muscle form
Synonyms:
Glycogen Phosphorylase (PYGM) Glycogen phosphorylase, muscle form PYGM | PYGM_RABIT
Type:
Enzyme
Mol. Mass.:
97296.32
Organism:
Oryctolagus cuniculus (rabbit)
Description:
Phosphorylation of Ser-15 converts phosphorylase B (unphosphorylated) to phosphorylase A.
Residue:
843
  
Inhibitor
Name:
BDBM50277972
Synonyms:
CHEMBL519503 | [5-(6-Amino-9-phenethyl-9H-purin-8-yl)-furan-2-yl]-phosphonic Acid
Type:
Small organic molecule
Emp. Form.:
C17H16N5O4P
Mol. Mass.:
385.3138
SMILES:
Nc1ncnc2n(CCc3ccccc3)c(nc12)-c1ccc(o1)P(O)(O)=O
: