Target
Proto-oncogene tyrosine-protein kinase Src
Ligand
BDBM50259376
Substrate
Meas. Tech.
ChEMBL_499164 (CHEMBL1011438)
IC50
>50000±n/a nM
Citation
 Lovering, FKirincich, SWang, WCombs, KResnick, LSabalski, JEButera, JLiu, JParris, KTelliez, JB Identification and SAR of squarate inhibitors of mitogen activated protein kinase-activated protein kinase 2 (MK-2). Bioorg Med Chem 17:3342-51 (2009)  
Target
Name:
Proto-oncogene tyrosine-protein kinase Src
Synonyms:
Calmodulin/Proto-oncogene tyrosine-protein kinase Src Proto-oncogene c-Src SRC SRC_HUMAN V-src sarcoma (Schmidt-Ruppin A-2) viral oncogene homolog (avian) p60-Src | pp60c-src
Type:
Protein
Mol. Mass.:
59838.60
Organism:
Homo sapiens (Human)
Description:
P12931
Residue:
536
  
Inhibitor
Name:
BDBM50259376
Synonyms:
3-((R)-1-Phenyl-ethylamino)-4-(pyridin-4-ylamino)-cyclobut-3-ene-1,2-dione CHEMBL466496
Type:
Small organic molecule
Emp. Form.:
C17H15N3O2
Mol. Mass.:
293.3199
SMILES:
C[C@@H](Nc1c(Nc2ccncc2)c(=O)c1=O)c1ccccc1
: