Target
Casein kinase I isoform gamma-1
Ligand
BDBM50259376
Substrate
Meas. Tech.
ChEMBL_499154 (CHEMBL1011428)
IC50
250±n/a nM
Citation
 Lovering, FKirincich, SWang, WCombs, KResnick, LSabalski, JEButera, JLiu, JParris, KTelliez, JB Identification and SAR of squarate inhibitors of mitogen activated protein kinase-activated protein kinase 2 (MK-2). Bioorg Med Chem 17:3342-51 (2009)  
Target
Name:
Casein kinase I isoform gamma-1
Synonyms:
CKI-gamma 1 Casein kinase I Casein kinase I isoform gamma-1 | KC1G1_HUMAN
Type:
PROTEIN
Mol. Mass.:
48530.93
Organism:
Homo sapiens (Human)
Description:
ChEMBL_774608
Residue:
422
  
Inhibitor
Name:
BDBM50259376
Synonyms:
3-((R)-1-Phenyl-ethylamino)-4-(pyridin-4-ylamino)-cyclobut-3-ene-1,2-dione CHEMBL466496
Type:
Small organic molecule
Emp. Form.:
C17H15N3O2
Mol. Mass.:
293.3199
SMILES:
C[C@@H](Nc1c(Nc2ccncc2)c(=O)c1=O)c1ccccc1
: