Target
Rho-associated protein kinase 1
Ligand
BDBM50259376
Substrate
Meas. Tech.
ChEMBL_499162 (CHEMBL1011436)
IC50
60±n/a nM
Citation
 Lovering, FKirincich, SWang, WCombs, KResnick, LSabalski, JEButera, JLiu, JParris, KTelliez, JB Identification and SAR of squarate inhibitors of mitogen activated protein kinase-activated protein kinase 2 (MK-2). Bioorg Med Chem 17:3342-51 (2009)  
Target
Name:
Rho-associated protein kinase 1
Synonyms:
ROCK-I ROCK1_HUMAN Rho-associated protein kinase Rho-associated, coiled-coil-containing protein kinase 1 Rho-kinase (ROCK I) p160 ROCK-1 | p160ROCK
Type:
Serine/threonine-protein kinase
Mol. Mass.:
158156.77
Organism:
Homo sapiens (Human)
Description:
Q13464
Residue:
1354
  
Inhibitor
Name:
BDBM50259376
Synonyms:
3-((R)-1-Phenyl-ethylamino)-4-(pyridin-4-ylamino)-cyclobut-3-ene-1,2-dione CHEMBL466496
Type:
Small organic molecule
Emp. Form.:
C17H15N3O2
Mol. Mass.:
293.3199
SMILES:
C[C@@H](Nc1c(Nc2ccncc2)c(=O)c1=O)c1ccccc1
: