Target
Cytochrome P450 2C9
Ligand
BDBM50259376
Substrate
Meas. Tech.
ChEMBL_499145 (CHEMBL1011419)
IC50
600±n/a nM
Citation
 Lovering, FKirincich, SWang, WCombs, KResnick, LSabalski, JEButera, JLiu, JParris, KTelliez, JB Identification and SAR of squarate inhibitors of mitogen activated protein kinase-activated protein kinase 2 (MK-2). Bioorg Med Chem 17:3342-51 (2009)  
Target
Name:
Cytochrome P450 2C9
Synonyms:
(R)-limonene 6-monooxygenase CP2C9_HUMAN CYP2C9 Cytochrome P450 2C9 (CYP2C9 ) P-450MP P450 PB-1 | S-mephenytoin 4-hydroxylase
Type:
Enzyme
Mol. Mass.:
55636.33
Organism:
Homo sapiens (Human)
Description:
P11712
Residue:
490
  
Inhibitor
Name:
BDBM50259376
Synonyms:
3-((R)-1-Phenyl-ethylamino)-4-(pyridin-4-ylamino)-cyclobut-3-ene-1,2-dione CHEMBL466496
Type:
Small organic molecule
Emp. Form.:
C17H15N3O2
Mol. Mass.:
293.3199
SMILES:
C[C@@H](Nc1c(Nc2ccncc2)c(=O)c1=O)c1ccccc1
: