Target
Trifunctional purine biosynthetic protein adenosine-3
Ligand
BDBM18796
Substrate
Meas. Tech.
ChEMBL_497843 (CHEMBL1003026)
IC50
>20000±n/a nM
Citation
 Deng, YZhou, XKugel Desmoulin, SWu, JCherian, CHou, ZMatherly, LHGangjee, A Synthesis and biological activity of a novel series of 6-substituted thieno[2,3-d]pyrimidine antifolate inhibitors of purine biosynthesis with selectivity for high affinity folate receptors over the reduced folate carrier and proton-coupled folate transporter for cellular entry. J Med Chem 52:2940-51 (2009)  
Target
Name:
Trifunctional purine biosynthetic protein adenosine-3
Synonyms:
GAR transformylase PUR2_MOUSE
Type:
PROTEIN
Mol. Mass.:
107504.27
Organism:
Mus musculus
Description:
ChEMBL_497843
Residue:
1010
  
Inhibitor
Name:
BDBM18796
Synonyms:
(2S)-2-{[4-(2-{2-amino-4-oxo-1H,4H,7H-pyrrolo[2,3-d]pyrimidin-5-yl}ethyl)phenyl]formamido}pentanedioic acid Pemetrexed
Type:
Small organic molecule
Emp. Form.:
C20H21N5O6
Mol. Mass.:
427.4106
SMILES:
Nc1nc2[nH]cc(CCc3ccc(cc3)C(=O)N[C@@H](CCC(O)=O)C(O)=O)c2c(=O)[nH]1
: