Target
Potassium voltage-gated channel subfamily A member 5
Ligand
BDBM50258502
Substrate
Meas. Tech.
ChEMBL_499826 (CHEMBL972458)
IC50
430±n/a nM
Citation
 Gross, MFCastle, NAZou, AWickenden, ADYu, WSpear, KL Aryl sulfonamido tetralin inhibitors of the Kv1.5 ion channel. Bioorg Med Chem Lett 19:3063-6 (2009)  
Target
Name:
Potassium voltage-gated channel subfamily A member 5
Synonyms:
HK2 KCNA5 Potassium voltage-gated channel subfamily A member 5 Voltage-gated potassium channel subunit Kv1.5
Type:
Enzyme
Mol. Mass.:
67222.47
Organism:
Homo sapiens (Human)
Description:
P22460
Residue:
613
  
Inhibitor
Name:
BDBM50258502
Synonyms:
CHEMBL512964 | N-((7R,8R)-7-hydroxy-8-(4-isopropylphenylsulfonamido)-5,6,7,8-tetrahydronaphthalen-2-yl)-3-methoxybenzamide
Type:
Small organic molecule
Emp. Form.:
C27H30N2O5S
Mol. Mass.:
494.603
SMILES:
COc1cccc(c1)C(=O)Nc1ccc2CC[C@@H](O)[C@H](NS(=O)(=O)c3ccc(cc3)C(C)C)c2c1
: