Target
Potassium voltage-gated channel subfamily A member 5
Ligand
BDBM50258757
Substrate
Meas. Tech.
ChEMBL_499826 (CHEMBL972458)
IC50
350±n/a nM
Citation
 Gross, MFCastle, NAZou, AWickenden, ADYu, WSpear, KL Aryl sulfonamido tetralin inhibitors of the Kv1.5 ion channel. Bioorg Med Chem Lett 19:3063-6 (2009)  
Target
Name:
Potassium voltage-gated channel subfamily A member 5
Synonyms:
HK2 KCNA5 Potassium voltage-gated channel subfamily A member 5 Voltage-gated potassium channel subunit Kv1.5
Type:
Enzyme
Mol. Mass.:
67222.47
Organism:
Homo sapiens (Human)
Description:
P22460
Residue:
613
  
Inhibitor
Name:
BDBM50258757
Synonyms:
(1S,2S)-N-((7R,8R)-8-(4-ethylphenylsulfonamido)-7-hydroxy-5,6,7,8-tetrahydronaphthalen-2-yl)-2-phenylcyclopropanecarboxamide | CHEMBL512242
Type:
Small organic molecule
Emp. Form.:
C28H30N2O4S
Mol. Mass.:
490.614
SMILES:
CCc1ccc(cc1)S(=O)(=O)N[C@H]1[C@H](O)CCc2ccc(NC(=O)[C@H]3C[C@@H]3c3ccccc3)cc12
: