Target
Potassium voltage-gated channel subfamily A member 5
Ligand
BDBM50258799
Substrate
Meas. Tech.
ChEMBL_499826 (CHEMBL972458)
IC50
610±n/a nM
Citation
 Gross, MFCastle, NAZou, AWickenden, ADYu, WSpear, KL Aryl sulfonamido tetralin inhibitors of the Kv1.5 ion channel. Bioorg Med Chem Lett 19:3063-6 (2009)  
Target
Name:
Potassium voltage-gated channel subfamily A member 5
Synonyms:
HK2 KCNA5 Potassium voltage-gated channel subfamily A member 5 Voltage-gated potassium channel subunit Kv1.5
Type:
Enzyme
Mol. Mass.:
67222.47
Organism:
Homo sapiens (Human)
Description:
P22460
Residue:
613
  
Inhibitor
Name:
BDBM50258799
Synonyms:
CHEMBL466858 | N-((1R,2R)-7-(3-benzylureido)-2-hydroxy-1,2,3,4-tetrahydronaphthalen-1-yl)-4-ethylbenzenesulfonamide
Type:
Small organic molecule
Emp. Form.:
C26H29N3O4S
Mol. Mass.:
479.591
SMILES:
CCc1ccc(cc1)S(=O)(=O)N[C@H]1[C@H](O)CCc2ccc(NC(=O)NCc3ccccc3)cc12
: