Target
Potassium voltage-gated channel subfamily A member 5
Ligand
BDBM50258800
Substrate
Meas. Tech.
ChEMBL_499826 (CHEMBL972458)
IC50
590±n/a nM
Citation
 Gross, MFCastle, NAZou, AWickenden, ADYu, WSpear, KL Aryl sulfonamido tetralin inhibitors of the Kv1.5 ion channel. Bioorg Med Chem Lett 19:3063-6 (2009)  
Target
Name:
Potassium voltage-gated channel subfamily A member 5
Synonyms:
HK2 KCNA5 Potassium voltage-gated channel subfamily A member 5 Voltage-gated potassium channel subunit Kv1.5
Type:
Enzyme
Mol. Mass.:
67222.47
Organism:
Homo sapiens (Human)
Description:
P22460
Residue:
613
  
Inhibitor
Name:
BDBM50258800
Synonyms:
(S)-N-(8-(4-ethylphenylsulfonamido)-5,6,7,8-tetrahydronaphthalen-2-yl)-3-methoxybenzamide | CHEMBL513486
Type:
Small organic molecule
Emp. Form.:
C26H28N2O4S
Mol. Mass.:
464.577
SMILES:
CCc1ccc(cc1)S(=O)(=O)N[C@H]1CCCc2ccc(NC(=O)c3cccc(OC)c3)cc12
: