Target
Alpha-1A adrenergic receptor
Ligand
BDBM50258450
Substrate
Meas. Tech.
ChEMBL_500271 (CHEMBL969606)
IC50
>10000±n/a nM
Citation
 Suzuki, TMoriya, MSakamoto, TSuga, TKishino, HTakahashi, HIshikawa, MNagai, KImai, YSekino, EIto, MIwaasa, HIshihara, ATokita, SKanatani, ASato, NFukami, T Discovery of novel spiro-piperidine derivatives as highly potent and selective melanin-concentrating hormone 1 receptor antagonists. Bioorg Med Chem Lett 19:3072-7 (2009)  
Target
Name:
Alpha-1A adrenergic receptor
Synonyms:
ADA1A_HUMAN ADRA1C Alpha 1A-adrenoceptor Alpha adrenergic receptor 1a Alpha-adrenergic receptor 1c adrenergic Alpha1 | adrenergic Alpha1C
Type:
Cell-surface receptors
Mol. Mass.:
51511.67
Organism:
Homo sapiens (Human)
Description:
P35348
Residue:
466
  
Inhibitor
Name:
BDBM50258450
Synonyms:
(+/-)-2-(3,4-difluorophenyl)-N-(3-(6-fluoro-1H-spiro[furo[3,4-c]pyridine-3,4'-piperidine]-1'-yl)propyl)-N-methyl-2-(1H-pyrazol-1-yl)acetamide CHEMBL466425
Type:
Small organic molecule
Emp. Form.:
C26H28F3N5O2
Mol. Mass.:
499.528
SMILES:
CN(CCCN1CCC2(CC1)OCc1cc(F)ncc21)C(=O)C(c1ccc(F)c(F)c1)n1cccn1
: