Target
Pituitary adenylate cyclase-activating polypeptide type I receptor
Ligand
BDBM50250088
Substrate
Meas. Tech.
ChEMBL_498612 (CHEMBL966958)
EC50
1030±n/a nM
Citation
 Bourgault, SVaudry, DSégalas-Milazzo, IGuilhaudis, LCouvineau, ALaburthe, MVaudry, HFournier, A Molecular and conformational determinants of pituitary adenylate cyclase-activating polypeptide (PACAP) for activation of the PAC1 receptor. J Med Chem 52:3308-16 (2009)  
Target
Name:
Pituitary adenylate cyclase-activating polypeptide type I receptor
Synonyms:
ADCYAP1R1 | PACR_HUMAN
Type:
PROTEIN
Mol. Mass.:
53307.50
Organism:
Homo sapiens (Human)
Description:
ChEMBL_498617
Residue:
468
  
Inhibitor
Name:
BDBM50250088
Synonyms:
CHEMBL524528 | [gamma-lactam4,5]PACAP27
Type:
Small organic molecule
Emp. Form.:
C144H226N40O39S
Mol. Mass.:
3173.645
SMILES:
CSCC[C@H](NC(=O)[C@H](CCC(N)=O)NC(=O)[C@H](CCCCN)NC(=O)[C@H](CCCN=C(N)N)NC(=O)[C@H](Cc1ccc(O)cc1)NC(=O)[C@H](CCCN=C(N)N)NC(=O)[C@H](CO)NC(=O)[C@H](Cc1ccc(O)cc1)NC(=O)[C@H](CO)NC(=O)[C@H](CC(O)=O)NC(=O)[C@@H](NC(=O)[C@H](Cc1ccccc1)NC(=O)[C@H](CC(C)C)N1CC[C@H](NC(=O)[C@H](CC(O)=O)NC(=O)[C@H](CO)NC(=O)[C@@H](N)Cc2cnc[nH]2)C1=O)[C@@H](C)O)C(=O)N[C@@H](C)C(=O)N[C@@H](C(C)C)C(=O)N[C@@H](CCCCN)C(=O)N[C@@H](CCCCN)C(=O)N[C@@H](Cc1ccc(O)cc1)C(=O)N[C@@H](CC(C)C)C(=O)N[C@@H](C)C(=O)N[C@@H](C)C(=O)N[C@@H](C(C)C)C(=O)N[C@@H](CC(C)C)C(N)=O
: