Target
Histone-arginine methyltransferase CARM1
Ligand
BDBM50258749
Substrate
Meas. Tech.
ChEMBL_500555 (CHEMBL971420)
IC50
310±n/a nM
Citation
 Huynh, TChen, ZPang, SGeng, JBandiera, TBindi, SVianello, PRoletto, FThieffine, SGalvani, AVaccaro, WPoss, MATrainor, GLLorenzi, MVGottardis, MJayaraman, LPurandare, AV Optimization of pyrazole inhibitors of Coactivator Associated Arginine Methyltransferase 1 (CARM1). Bioorg Med Chem Lett 19:2924-7 (2009)  
Target
Name:
Histone-arginine methyltransferase CARM1
Synonyms:
CARM1 Coactivator-associated arginine methyltransferase 1 PRMT4 Protein arginine methyltransferase 4 (PRMT4)
Type:
Protein
Mol. Mass.:
65855.47
Organism:
Homo sapiens (Human)
Description:
Q86X55
Residue:
608
  
Inhibitor
Name:
BDBM50258749
Synonyms:
(S)-2-amino-N-(3-(5-(5-benzyl-1,3,4-oxadiazol-2-yl)-3-(trifluoromethyl)-1H-pyrazol-1-yl)benzyl)propanamide | CHEMBL468712
Type:
Small organic molecule
Emp. Form.:
C23H21F3N6O2
Mol. Mass.:
470.447
SMILES:
C[C@H](N)C(=O)NCc1cccc(c1)-n1nc(cc1-c1nnc(Cc2ccccc2)o1)C(F)(F)F
: