Target
Histone-arginine methyltransferase CARM1
Ligand
BDBM50258817
Substrate
Meas. Tech.
ChEMBL_500555 (CHEMBL971420)
IC50
400±n/a nM
Citation
 Huynh, TChen, ZPang, SGeng, JBandiera, TBindi, SVianello, PRoletto, FThieffine, SGalvani, AVaccaro, WPoss, MATrainor, GLLorenzi, MVGottardis, MJayaraman, LPurandare, AV Optimization of pyrazole inhibitors of Coactivator Associated Arginine Methyltransferase 1 (CARM1). Bioorg Med Chem Lett 19:2924-7 (2009)  
Target
Name:
Histone-arginine methyltransferase CARM1
Synonyms:
CARM1 Coactivator-associated arginine methyltransferase 1 PRMT4 Protein arginine methyltransferase 4 (PRMT4)
Type:
Protein
Mol. Mass.:
65855.47
Organism:
Homo sapiens (Human)
Description:
Q86X55
Residue:
608
  
Inhibitor
Name:
BDBM50258817
Synonyms:
(S)-2-amino-N-(3-(1-methyl-4-(5-phenyl-1,3,4-oxadiazol-2-yl)-1H-pyrazol-3-yl)benzyl)propanamide | CHEMBL466638
Type:
Small organic molecule
Emp. Form.:
C22H22N6O2
Mol. Mass.:
402.4491
SMILES:
C[C@H](N)C(=O)NCc1cccc(c1)-c1nn(C)cc1-c1nnc(o1)-c1ccccc1
: