Target
Stromelysin-1
Ligand
BDBM50203534
Substrate
Meas. Tech.
ChEMBL_523766 (CHEMBL1008374)
IC50
>5000±n/a nM
Citation
 Burns, DMLi, YLShi, EHe, CXu, MZhuo, JZhang, CQian, DQLi, YWynn, RCovington, MBKatiyar, KMarando, CAFridman, JSScherle, PFriedman, SMetcalf, BYao, W Compelling P1 substituent affect on metalloprotease binding profile enables the design of a novel cyclohexyl core scaffold with excellent MMP selectivity and HER-2 sheddase inhibition. Bioorg Med Chem Lett 19:3525-30 (2009)  
Target
Name:
Stromelysin-1
Synonyms:
MMP-3 MMP3_HUMAN Matrix metalloproteinase 3 Matrix metalloproteinase-3 (MMP-3) SL-1 Stromelysin 1 | Transin-1
Type:
Enzyme
Mol. Mass.:
53973.13
Organism:
Homo sapiens (Human)
Description:
P08254
Residue:
477
  
Inhibitor
Name:
BDBM50203534
Synonyms:
(6S,7S)-N-hydroxy-5-methyl-6-(4-phenylpiperazine-1-carbonyl)-5-azaspiro[2.5]octane-7-carboxamide CHEMBL387202
Type:
Small organic molecule
Emp. Form.:
C20H28N4O3
Mol. Mass.:
372.4613
SMILES:
CN1CC2(CC2)C[C@@H]([C@H]1C(=O)N1CCN(CC1)c1ccccc1)C(=O)NO
: