Target
Neuropeptide Y receptor type 5
Ligand
BDBM50249865
Substrate
Meas. Tech.
ChEMBL_498773 (CHEMBL1021965)
Ki
2±n/a nM
Citation
 Sato, NAndo, MIshikawa, SJitsuoka, MNagai, KTakahashi, HSakuraba, ATsuge, HKitazawa, HIwaasa, HMashiko, SGomori, AMoriya, RFujino, NOhe, TIshihara, AKanatani, AFukami, T Discovery of tetrasubstituted imidazolines as potent and selective neuropeptide Y Y5 receptor antagonists: reduced human ether-a-go-go related gene potassium channel binding affinity and potent antiobesity effect. J Med Chem 52:3385-96 (2009)  
Target
Name:
Neuropeptide Y receptor type 5
Synonyms:
NPY-Y5 NPY5-R NPY5R_HUMAN NPYY5 Neuropeptide Y receptor type 5 ( NPY Y5) | Y5 receptor
Type:
Enzyme
Mol. Mass.:
50746.64
Organism:
Homo sapiens (Human)
Description:
Q15761
Residue:
445
  
Inhibitor
Name:
BDBM50249865
Synonyms:
2-Fluoro-5-[(4S,5S)-4-(4-fluorophenyl)-5-methyl-2-(1,2,5-thiadiazol-3-yl)-4,5-dihydro-1H-imidazol-4-yl]pyridine | CHEMBL523945
Type:
Small organic molecule
Emp. Form.:
C17H13F2N5S
Mol. Mass.:
357.38
SMILES:
C[C@@H]1NC(=N[C@@]1(c1ccc(F)cc1)c1ccc(F)nc1)c1cnsn1
: