Target
Peroxisome proliferator-activated receptor gamma
Ligand
BDBM50166298
Substrate
Meas. Tech.
ChEMBL_520073 (CHEMBL940694)
EC50
3±n/a nM
Citation
 Acton, JJAkiyama, TEChang, CHColwell, LDebenham, SDoebber, TEinstein, MLiu, KMcCann, MEMoller, DEMuise, ESTan, YThompson, JRWong, KKWu, MXu, LMeinke, PTBerger, JPWood, HB Discovery of (2R)-2-(3-{3-[(4-Methoxyphenyl)carbonyl]-2-methyl-6-(trifluoromethoxy)-1H-indol-1-yl}phenoxy)butanoic acid (MK-0533): a novel selective peroxisome proliferator-activated receptor gamma modulator for the treatment of type 2 diabetes mellitus with a reduced potential to increase plasma a J Med Chem 52:3846-54 (2009)  
Target
Name:
Peroxisome proliferator-activated receptor gamma
Synonyms:
NR1C3 PPAR-gamma PPARG_HUMAN Peroxisome proliferator-activated receptor gamma (PPAR gamma) Peroxisome proliferator-activated receptor gamma (PPARĪ³) peroxisome proliferator-activated receptor gamma isoform 2
Type:
Nuclear Receptor
Mol. Mass.:
57613.46
Organism:
Homo sapiens (Human)
Description:
P37231
Residue:
505
  
Inhibitor
Name:
BDBM50166298
Synonyms:
(2S)-2-(4-chloro-3-(1-(6-chlorobenzo[d]isoxazol-3-yl)-2-methyl-5-(trifluoromethoxy)-1H-indol-3-yloxy)phenoxy)propanoic acid CHEMBL363805
Type:
Small organic molecule
Emp. Form.:
C26H17Cl2F3N2O6
Mol. Mass.:
581.324
SMILES:
C[C@H](Oc1ccc(Cl)c(Oc2c(C)n(-c3noc4cc(Cl)ccc34)c3ccc(OC(F)(F)F)cc23)c1)C(O)=O
: