Target
Neuronal acetylcholine receptor subunit alpha-4
Ligand
BDBM50279209
Substrate
Meas. Tech.
ChEMBL_546015 (CHEMBL1028493)
Ki
941±n/a nM
Citation
 Tasso, BCanu Boido, CTerranova, EGotti, CRiganti, LClementi, FArtali, RBombieri, GMeneghetti, FSparatore, F Synthesis, binding, and modeling studies of new cytisine derivatives, as ligands for neuronal nicotinic acetylcholine receptor subtypes. J Med Chem 52:4345-57 (2009)  
Target
Name:
Neuronal acetylcholine receptor subunit alpha-4
Synonyms:
ACHA4_RAT Cholinergic, Nicotinic Alpha4Beta2 Chrna4 Neuronal acetylcholine receptor (alpha4beta2 nAChR) Neuronal acetylcholine receptor subunit alpha 4 beta 2 | Neuronal acetylcholine receptor subunit alpha-4
Type:
Enzyme
Mol. Mass.:
70196.44
Organism:
Rattus norvegicus (Rat)
Description:
P09483
Residue:
630
  
Inhibitor
Name:
BDBM50279209
Synonyms:
CHEMBL498277 | N-[2-(Pyridin-2-yl)ethyl]cytisine
Type:
Small organic molecule
Emp. Form.:
C18H21N3O
Mol. Mass.:
295.3788
SMILES:
O=c1cccc2[C@@H]3C[C@@H](CN(CCc4ccccn4)C3)Cn12
: