Target
Tubulin alpha-1A chain
Ligand
BDBM50279934
Substrate
Meas. Tech.
ChEBML_212054
Ki
11500±n/a nM
Citation
 Hahn, KMHumphreys, WHelms, AMHastie, SBMacdonald, TL Structural requirements for the binding of colchicine analogs to tubulin: the role of the C-10 substituent Bioorg Med Chem Lett 1:471-476 (1991)    Article 
Target
Name:
Tubulin alpha-1A chain
Synonyms:
TBA1A_PIG Tubulin Tubulin alpha-1A chain
Type:
Protein
Mol. Mass.:
50049.25
Organism:
Sus scrofa (Pig)
Description:
P02550
Residue:
451
  
Inhibitor
Name:
BDBM50279934
Synonyms:
2-Methoxy-5-(2,3,4-trimethoxy-phenyl)-cyclohepta-2,4,6-trienone CHEMBL79720
Type:
Small organic molecule
Emp. Form.:
C17H18O5
Mol. Mass.:
302.3218
SMILES:
COc1ccc(c(OC)c1OC)-c1ccc(OC)c(=O)cc1
: