Target
Tubulin alpha-1A chain
Ligand
BDBM50280009
Substrate
Meas. Tech.
ChEBML_212054
Ki
750±n/a nM
Citation
 Hahn, KMHumphreys, WHelms, AMHastie, SBMacdonald, TL Structural requirements for the binding of colchicine analogs to tubulin: the role of the C-10 substituent Bioorg Med Chem Lett 1:471-476 (1991)    Article 
Target
Name:
Tubulin alpha-1A chain
Synonyms:
TBA1A_PIG Tubulin Tubulin alpha-1A chain
Type:
Protein
Mol. Mass.:
50049.25
Organism:
Sus scrofa (Pig)
Description:
P02550
Residue:
451
  
Inhibitor
Name:
BDBM50280009
Synonyms:
CHEMBL88059 N-(1,2,3-Trimethoxy-10-methylamino-9-oxo-5,6,7,9-tetrahydro-benzo[a]heptalen-7-yl)-acetamide
Type:
Small organic molecule
Emp. Form.:
C22H26N2O5
Mol. Mass.:
398.4522
SMILES:
CNc1ccc2-c3c(CC[C@H](NC(C)=O)c2cc1=O)cc(OC)c(OC)c3OC
: