Target
Carboxylic ester hydrolase
Ligand
BDBM50280627
Substrate
Meas. Tech.
ChEBML_41589
IC50
15±n/a nM
Citation
 Gregor, VEEmmerling, MRLee, CMoore, CJ The synthesis and in vitro acetylcholinesterase and butyrylcholinesterase inhibitory activity of tacrine (Cognex®) derivaties Bioorg Med Chem Lett 2:861-864 (1992)    Article 
Target
Name:
Carboxylic ester hydrolase
Synonyms:
BuChE Butyrylcholine esterase Butyrylcholinesterase (BChE) Butyrylcholinesterase (EqBuChE) butyrylcholinesterase precursor
Type:
Protein
Mol. Mass.:
68842.83
Organism:
Equus caballus (Horse)
Description:
Q9N1N9
Residue:
602
  
Inhibitor
Name:
BDBM50280627
Synonyms:
5-chloro-10-azatetracyclo[10.2.1.02,11.04,9]pentadeca-2,4,6,8,10-pentaen-3-amine CHEMBL368196
Type:
Small organic molecule
Emp. Form.:
C14H13ClN2
Mol. Mass.:
244.719
SMILES:
Nc1c2C3CCC(C3)c2nc2cccc(Cl)c12
: