Target
Carboxylic ester hydrolase
Ligand
BDBM8987
Substrate
Meas. Tech.
ChEBML_41589
IC50
7.9±n/a nM
Citation
 Gregor, VEEmmerling, MRLee, CMoore, CJ The synthesis and in vitro acetylcholinesterase and butyrylcholinesterase inhibitory activity of tacrine (Cognex®) derivaties Bioorg Med Chem Lett 2:861-864 (1992)    Article 
Target
Name:
Carboxylic ester hydrolase
Synonyms:
BuChE Butyrylcholine esterase Butyrylcholinesterase (BChE) Butyrylcholinesterase (EqBuChE) butyrylcholinesterase precursor
Type:
Protein
Mol. Mass.:
68842.83
Organism:
Equus caballus (Horse)
Description:
Q9N1N9
Residue:
602
  
Inhibitor
Name:
BDBM8987
Synonyms:
6-chloro-1,2,3,4-tetrahydroacridin-9-amine 6-chlorotacrine.HCl Tacrine Analogue 4
Type:
Small organic molecule
Emp. Form.:
C13H13ClN2
Mol. Mass.:
232.709
SMILES:
Nc1c2CCCCc2nc2cc(Cl)ccc12
: